BDBM50180723 2-(thiophen-2-yl)-1H-benzo[d]imidazole::2-thiophene-2-yl-1H-benzoimidazole::CHEMBL201221::cid_506600
SMILES c1csc(c1)-c1nc2ccccc2[nH]1
InChI Key InChIKey=XXCGVPNWMZKOER-UHFFFAOYSA-N
Data  2 IC50
  Tab Delimited (TSV)   2D SDfile   Computed 3D by Vconf -m prep SDfile
Find this compound or compounds like it in BindingDB:
Activity Spreadsheet -- Enzyme Inhibition Constant Data from BindingDB
Found 1 hit for monomerid = 50180723
TargetCoagulation factor XII(Homo sapiens (Human))
Pcmd
Curated by PubChem BioAssay
LigandPNGBDBM50180723(2-(thiophen-2-yl)-1H-benzo[d]imidazole | 2-thiophe...)
Affinity DataIC50: >5.00E+4nM. Assay description: Molecular Library Screening Center Network (MLSCN) Penn Center for Molecular Discovery (PCMD) Assay Provider: Scott L. Diamond, University of Pennsy...
In DepthDetails PCBioAssay